[Webkit-unassigned] [Bug 272297] New: Error occurred during compiling WebKit:d: framework not found serviceextensions clang: error: linker command failed with exit code 1

bugzilla-daemon at webkit.org bugzilla-daemon at webkit.org
Sun Apr 7 01:47:32 PDT 2024


https://bugs.webkit.org/show_bug.cgi?id=272297

            Bug ID: 272297
           Summary: Error occurred during compiling WebKit:d: framework
                    not found serviceextensions clang: error: linker
                    command failed with exit code 1
           Product: WebKit
           Version: Safari 17
          Hardware: Unspecified
                OS: Unspecified
            Status: NEW
          Severity: Normal
          Priority: P2
         Component: CMake
          Assignee: webkit-unassigned at lists.webkit.org
          Reporter: 576527857 at qq.com

When I compile using the "./Tools/Scripts/build-webkit --debug --ios-simulator" command, I encounter the error: "ld: framework not found serviceextensions clang: error: linker command failed with exit code 1". What could be the reason for this, and how can I configure it to compile correctly?

-- 
You are receiving this mail because:
You are the assignee for the bug.
-------------- next part --------------
An HTML attachment was scrubbed...
URL: <http://lists.webkit.org/pipermail/webkit-unassigned/attachments/20240407/c64237c5/attachment.htm>


More information about the webkit-unassigned mailing list