[Webkit-unassigned] [Bug 187701] [GTK][BUILD] FAILED: lib/libwebkit2gtk-4.0.so.37.31.0 collect2: error: ld returned 1 exit status

bugzilla-daemon at webkit.org bugzilla-daemon at webkit.org
Thu Jul 19 22:45:30 PDT 2018


--- Comment #11 from karogyoker2+webkit at gmail.com ---

OK, now I got this:
Linking CXX shared library lib/libwebkit2gtk-4.0.so.37.31.0
FAILED: lib/libwebkit2gtk-4.0.so.37.31.0
/usr/bin/i686-linux-gnu-ld: final link failed: Memory exhausted
collect2: error: ld returned 1 exit status
ninja: build stopped: subcommand failed.

There were still more than 1.5GB space in the swap, also the host had 3GB physical free RAM too.

Isn't this happening because on a 32 bit OS a process can use maximum 4GB memory?
I could put 16GB extra RAM into this machine so I would have 24GB, but I think it might not help.

Do I need to cross-compile then? Are there any instructions how to do it for WebKit?

You are receiving this mail because:
You are the assignee for the bug.
-------------- next part --------------
An HTML attachment was scrubbed...
URL: <http://lists.webkit.org/pipermail/webkit-unassigned/attachments/20180720/f7c79ad1/attachment.html>

More information about the webkit-unassigned mailing list