[Webkit-unassigned] [Bug 156596] New: Webkitgtk+ 2.12.1: Build Failure on slackware box: PRId64 not defined

bugzilla-daemon at webkit.org bugzilla-daemon at webkit.org
Thu Apr 14 13:55:09 PDT 2016


https://bugs.webkit.org/show_bug.cgi?id=156596

            Bug ID: 156596
           Summary: Webkitgtk+ 2.12.1:  Build Failure on slackware box:
                    PRId64 not defined
    Classification: Unclassified
           Product: WebKit
           Version: Other
          Hardware: PC
                OS: Linux
            Status: NEW
          Severity: Major
          Priority: P2
         Component: WebKit Misc.
          Assignee: webkit-unassigned at lists.webkit.org
          Reporter: David.Ronis at McGill.CA

I'm trying to upgrade webkitgtk+ 2.12.1 on a Slackware 64 bit box.  The build dies (the log follows) having not found a definition for PRId64.   Grep shows several files in my include path
that contain the definition, and if I manually set it, the problem goes away.   Not surprisingly, the problem doesn't arise on my 32 bit machines.

Here's the log.

[ 54%] Building CXX object Source/WebCore/CMakeFiles/WebCore.dir/platform/network/ParsedContentRange.cpp.o
/home/ronis/Project/notar/GNOME/garnome/platform/webkitgtk+/work/main.d/webkitgtk-2.12.1/Source/WebCore/platform/network/ParsedContentRange.cpp: In member function ‘WTF::String WebCore::ParsedContentRange::headerValue() const’:
/home/ronis/Project/notar/GNOME/garnome/platform/webkitgtk+/work/main.d/webkitgtk-2.12.1/Source/WebCore/platform/network/ParsedContentRange.cpp:133:41: error: expected ‘)’ before ‘PRId64’
         return String::format("bytes %" PRId64 "-%" PRId64 "/*", m_firstBytePosition, m_lastBytePosition);
                                         ^
/home/ronis/Project/notar/GNOME/garnome/platform/webkitgtk+/work/main.d/webkitgtk-2.12.1/Source/WebCore/platform/network/ParsedContentRange.cpp:133:105: warning: spurious trailing ‘%’ in format [-Wformat=]
         return String::format("bytes %" PRId64 "-%" PRId64 "/*", m_firstBytePosition, m_lastBytePosition);
                                                                                                         ^
/home/ronis/Project/notar/GNOME/garnome/platform/webkitgtk+/work/main.d/webkitgtk-2.12.1/Source/WebCore/platform/network/ParsedContentRange.cpp:133:105: warning: too many arguments for format [-Wformat-extra-args]
/home/ronis/Project/notar/GNOME/garnome/platform/webkitgtk+/work/main.d/webkitgtk-2.12.1/Source/WebCore/platform/network/ParsedContentRange.cpp:134:37: error: expected ‘)’ before ‘PRId64’
     return String::format("bytes %" PRId64 "-%" PRId64 "/%" PRId64, m_firstBytePosition, m_lastBytePosition, m_instanceLength);
                                     ^
/home/ronis/Project/notar/GNOME/garnome/platform/webkitgtk+/work/main.d/webkitgtk-2.12.1/Source/WebCore/platform/network/ParsedContentRange.cpp:134:126: warning: spurious trailing ‘%’ in format [-Wformat=]
     return String::format("bytes %" PRId64 "-%" PRId64 "/%" PRId64, m_firstBytePosition, m_lastBytePosition, m_instanceLength);
                                                                                                                              ^
/home/ronis/Project/notar/GNOME/garnome/platform/webkitgtk+/work/main.d/webkitgtk-2.12.1/Source/WebCore/platform/network/ParsedContentRange.cpp:134:126: warning: too many arguments for format [-Wformat-extra-args]
make[3]: *** [Source/WebCore/CMakeFiles/WebCore.dir/platform/network/ParsedContentRange.cpp.o] Error 1
make[3]: Leaving directory `/home/ronis/Project/notar/GNOME/garnome/platform/webkitgtk+/work/main.d/webkitgtk-2.12.1/build'
make[2]: *** [Source/WebCore/CMakeFiles/WebCore.dir/all] Error 2
make[2]: Leaving directory `/home/ronis/Project/notar/GNOME/garnome/platform/webkitgtk+/work/main.d/webkitgtk-2.12.1/build'
make[1]: *** [all] Error 2
make[1]: Leaving directory `/home/ronis/Project/notar/GNOME/garnome/platform/webkitgtk+/work/main.d/webkitgtk-2.12.1/build'
make: *** [build-work/main.d/webkitgtk-2.12.1/Makefile] Error 2

-- 
You are receiving this mail because:
You are the assignee for the bug.
-------------- next part --------------
An HTML attachment was scrubbed...
URL: <https://lists.webkit.org/pipermail/webkit-unassigned/attachments/20160414/c04d0192/attachment.html>


More information about the webkit-unassigned mailing list