[Webkit-unassigned] [Bug 140652] New: [EFL] REGRESSION(r178526): EWK2StorageManagerTest FAILED

bugzilla-daemon at webkit.org bugzilla-daemon at webkit.org
Mon Jan 19 17:52:21 PST 2015


https://bugs.webkit.org/show_bug.cgi?id=140652

            Bug ID: 140652
           Summary: [EFL] REGRESSION(r178526): EWK2StorageManagerTest
                    FAILED
    Classification: Unclassified
           Product: WebKit
           Version: 528+ (Nightly build)
          Hardware: Unspecified
                OS: Unspecified
            Status: NEW
          Severity: Normal
          Priority: P2
         Component: WebKit EFL
          Assignee: webkit-unassigned at lists.webkit.org
          Reporter: hs85.jeong at samsung.com
                CC: demarchi at webkit.org

../../Source/WebKit2/UIProcess/API/efl/tests/test_ewk2_storage_manager.cpp:152: Failure
Value of: originData.isSynchronized
  Actual: false
Expected: true
../../Source/WebKit2/UIProcess/API/efl/tests/test_ewk2_storage_manager.cpp:181: Failure
Value of: originData.isSynchronized
  Actual: false
Expected: true
[  FAILED  ] 2 tests, listed below:
[  FAILED  ] EWK2StorageManagerTest.ewk_storage_manager_origins_async_get
[  FAILED  ] EWK2StorageManagerTest.ewk_storage_manager_entries_for_origin_delete

-- 
You are receiving this mail because:
You are the assignee for the bug.
-------------- next part --------------
An HTML attachment was scrubbed...
URL: <http://lists.webkit.org/pipermail/webkit-unassigned/attachments/20150120/5a0729c1/attachment-0002.html>


More information about the webkit-unassigned mailing list