[Webkit-unassigned] [Bug 71371] JSC on linux showing 3 additional regressions

bugzilla-daemon at webkit.org bugzilla-daemon at webkit.org
Wed Nov 2 10:58:21 PDT 2011


https://bugs.webkit.org/show_bug.cgi?id=71371





--- Comment #3 from Andy Wingo <wingo at igalia.com>  2011-11-02 10:58:21 PST ---
Finally for the third regression:

Testcase ecma/Date/15.9.5.34-1.js failed 
[ Previous Failure | Next Failure | Top of Page ]

Failure messages were:
TDATE = new Date(now); (TDATE).setMonth(11,31); TDATE.getTime() = 1325348626478 FAILED! expected: 1325352226478
TDATE = new Date(now); (TDATE).setMonth(11,31); TDATE.valueOf() = 1325348626478 FAILED! expected: 1325352226478
TDATE = new Date(now); (TDATE).setMonth(11,31); TDATE.getUTCHours() = 16 FAILED! expected: 17
TDATE = new Date(now); (TDATE).setMonth(11,31); TDATE.getHours() = 17 FAILED! expected: 18

For the first two cases, the values differ by 3600000, or 1 hour.  Likewise for the last two cases.  Given that I am currently in Europe in a non-daylight-savings-time locale, perhaps this is related.

-- 
Configure bugmail: https://bugs.webkit.org/userprefs.cgi?tab=email
------- You are receiving this mail because: -------
You are the assignee for the bug.



More information about the webkit-unassigned mailing list