[Webkit-unassigned] [Bug 29562] New: [Qt] installation build failed

bugzilla-daemon at webkit.org bugzilla-daemon at webkit.org
Mon Sep 21 08:07:17 PDT 2009


           Summary: [Qt] installation build failed
           Product: WebKit
           Version: 528+ (Nightly build)
          Platform: Other
        OS/Version: Mac OS X 10.5
            Status: NEW
          Keywords: Qt
          Severity: Normal
          Priority: P2
         Component: New Bugs
        AssignedTo: webkit-unassigned at lists.webkit.org
        ReportedBy: vestbo at webkit.org

This bug report originated from Nokia internal issue QT-1700

--- Comments ---

Product: Qt

Function: BuildSystem

Version: 4.5.2

Platform: Vista
32-bit Vista Ultimate SP2 + all the latest updates as of today.

Compiler: MSVC
VS2008 SP1

Short description: Installation build failed


configure -debug-and-release

Expected to see:

Got instead:
..\..\..\..\lib\QtWebKitd4.dll : fatal error LNK1120: 8 unresolved externals
NMAKE : fatal error U1077: '"C:\Program Files\Microsoft Visual Studio
9.0\VC\BIN\link.EXE"' : return
code '0x460'
NMAKE : fatal error U1077: '"C:\Program Files\Microsoft Visual Studio
9.0\VC\BIN\nmake.exe"' : retur
n code '0x2'
NMAKE : fatal error U1077: 'cd' : return code '0x2'

More details:
This is the result for this package:  qt-sdk-win-opensource-2009.03.exe.  There
was no such build problem with the previous version 2009.02.  The only
difference is that this time I chose to install to C:/QT/qt instead of the
default location C:/QT/2009.03.

Configure bugmail: https://bugs.webkit.org/userprefs.cgi?tab=email
------- You are receiving this mail because: -------
You are the assignee for the bug.

More information about the webkit-unassigned mailing list