[webkit-qt] Error building WebKit 2.3

Lindsay Mathieson lindsay.mathieson at gmail.com
Fri Jan 4 18:00:25 PST 2013

Have had this for a while but only had the time to look into it recently.

Clean build of webkit 2.3 on Kubuntu 13.04 (KDE 4.10)

fatal error: LLIntAssembly.h: No such file or directory
compilation terminated.
make[3]: *** [obj/release/LowLevelInterpreter.o] Error 1
make[3]: *** Waiting for unfinished jobs....
make[3]: Leaving directory 
make[2]: *** [sub-Target-pri-make_default-ordered] Error 2
make[2]: Leaving directory 
make[1]: *** [sub-Source-JavaScriptCore-JavaScriptCore-pro-make_default-
ordered] Error 2
make[1]: Leaving directory `/data/dev/qtwebkit-23/WebKitBuild/Release'
make: *** [incremental] Error 2

There is no LLIntAssembly.h in the qtwebkit src tree.

Just to be sure I've done a 'git reset --hard HEAD' and I'm on the 
qtwebkit-2.3 branch.
Lindsay Mathieson
-------------- next part --------------
A non-text attachment was scrubbed...
Name: signature.asc
Type: application/pgp-signature
Size: 198 bytes
Desc: This is a digitally signed message part.
URL: <http://lists.webkit.org/pipermail/webkit-qt/attachments/20130105/c1e8314a/attachment.sig>

More information about the webkit-qt mailing list